{"text_format":"1","workbook":"xlsx","n_sheets":5,"sheets":["DADOS","DEMANDA","TAB","AUX","CAMPOS"],"not_rendered":{"charts":0,"images":0,"macros":1,"external_links":0,"defined_names":5,"comments":0,"pivot_tables":0},"unopened":[],"bounds":{"document_bytes":16777216,"sheet_cells":100000,"rows_first":2000,"rows_last":500,"rows_between":2000,"halvings":0,"cell_chars":16384,"cell_head_chars":4096},"cells_cut":0,"cells_raw":0,"read":"whole","date_system":"1900"}

{"sheet":"DADOS","index":0,"n_rows":56,"n_cols":41,"rows_kept":56,"cut":false,"hidden":false,"merged":[[7,2,10,4],[6,5,6,11],[7,5,10,21],[13,2,13,4],[14,2,14,4],[15,2,15,4],[16,2,16,4],[17,2,18,4],[15,18,15,19],[15,20,15,21],[6,17,6,19],[6,20,6,21],[6,2,6,4],[6,12,6,16],[11,6,12,21],[11,2,12,5],[13,5,13,21],[14,5,14,8],[14,9,14,10],[14,11,14,14],[14,15,14,17],[14,18,14,21],[15,5,15,14],[15,16,15,17],[20,2,21,5],[20,6,21,21],[16,5,16,10],[16,11,16,12],[16,13,16,19],[17,5,17,21],[18,5,18,21],[19,5,19,9],[19,11,19,15],[19,17,19,21],[19,2,19,4],[27,2,27,4],[27,5,27,6],[27,20,27,21],[27,7,27,15],[28,2,28,21],[27,16,27,17],[27,18,27,19],[35,2,39,21],[22,2,22,4],[23,20,23,21],[24,13,24,17],[24,5,24,10],[23,5,23,14],[22,5,22,21],[24,11,24,12],[24,18,24,19],[24,20,24,21],[25,2,26,5],[25,6,26,21],[23,16,23,17],[23,18,23,19],[24,2,24,4],[23,2,23,4],[29,19,29,21],[30,2,30,3],[30,4,30,6],[30,7,30,8],[30,9,30,11],[30,12,30,13],[30,14,30,16],[30,17,30,18],[30,19,30,21],[29,2,29,3],[29,4,29,6],[29,7,29,8],[29,9,29,11],[29,12,29,13],[29,14,29,16],[29,17,29,18],[31,12,31,13],[31,14,31,16],[31,17,31,18],[31,19,31,21],[32,2,32,3],[32,4,32,6],[32,7,32,8],[32,9,32,11],[32,12,32,13],[32,14,32,16],[31,2,31,3],[31,4,31,6],[31,7,31,8],[31,9,31,11],[32,17,32,18],[32,19,32,21],[33,2,33,3],[33,4,33,6],[33,7,33,8],[33,9,33,11],[33,12,33,13],[33,14,33,16],[33,17,33,18],[33,19,33,21],[55,2,60,21],[0,2,0,21],[3,2,5,21],[47,5,47,18],[47,2,47,4],[47,19,47,21],[48,2,54,21],[40,2,41,5],[40,6,41,21],[46,2,46,4],[44,2,45,4],[43,2,43,4],[42,2,42,4],[42,5,42,21],[43,18,43,21],[45,5,45,21],[46,5,46,9],[46,11,46,15],[44,5,44,21],[46,17,46,21],[34,2,34,21],[43,5,43,8],[43,9,43,10],[43,11,43,14],[43,15,43,17]]}
[null,null,"ANTES DE CADASTRAR OS DADOS, UTILIZE A OPÇÃO \"SALVAR COMO\" E CRIE UMA CÓPIA DESTE ARQUIVO"]
[null,null,null,null,null,null,null,null,null,null,null,null,null,null,null,null,null,null,null,null,null,null,null,null,null,null,"UF","mês","TEXTO","TIPO DE PROJETO","PESSOA","DOC1","DOC2","ZONA","MEDIÇÕES","MED","OBS","ORGAO","ano"]
[null,null,null,null,null,null,null,null,null,null,null,null,null,null,null,null,null,null,null,null,null,null,null,null,null,null,"PB","Janeiro","Favor Informar o total de UCs do empreendimento.","Subestação Aérea ","Pessoa Física","CPF:","RG/EMISSOR:","Urbana","NÃO","Nº UC:","OBSERVAÇÃO:","CREA",{"$f":"YEAR(TODAY())","v":2017}]
[null,null,"MEMORIAL TÉCNICO PARA PROJETO ELÉTRICO\nDE PADRÃO DE MEDIÇÃO PARA SUBESTAÇÃO AÉREA",null,null,null,null,null,null,null,null,null,null,null,null,null,null,null,null,null,null,null,null,null,null,null,"AC","Feveireiro","Favor informar a existencia ou não de medição(ões) existente(s) no local a ser atendido.","Subestação p/ Canteiro de Obras","Poder Publico","CNPJ:","INSC.ESTADUAL:","Rural","SIM","Nº MEDIDOR:","OBSERVAÇÃO: Por se tratar de um nº superior a 20 UCs existentes, favor informar as demais medições no espaço abaixo.","CAU",{"$f":"AM3+1","v":2018}]
[null,null,null,null,null,null,null,null,null,null,null,null,null,null,null,null,null,null,null,null,null,null,null,null,null,null,"AL","Março","Informo a NÃO EXISTÊNCIA de unidades Ligadas ou Desligadas mesmo que provinientes de imóvel já demolido no local a ser atendido.",null,"Empresa Privada",null,null,null,null,null,null,"Outros",{"$f":"AM4+1","v":2019}]
[null,null,null,null,null,null,null,null,null,null,null,null,null,null,null,null,null,null,null,null,null,null,null,null,null,null,"AM","Abril","Descrição das UC(S) ou Medidor (es) existente(s) no local a ser atendido."]
[null,null,"TIPO DE PROJETO:",null,null,"Subestação Aérea ",null,null,null,null,null,null,"PREVISÃO DE ATENDIMENTO:",null,null,null,null,"Junho",null,null,2017,null,null,null,null,null,"AP","Maio","Favor Informar o quantitativo de UC(s) existente(s)."]
[null,null,"FINALIDADE:",null,null,"Atender a um Hotel com entrada em tensão primária.",null,null,null,null,null,null,null,null,null,null,null,null,null,null,null,null,null,null,null,null,"BA","Junho","Existem Dados não informados para os campos acima!!! Favor preencher os campos solicitados!!!"]
[null,null,null,null,null,null,null,null,null,null,null,null,null,null,null,null,null,null,null,null,null,null,null,null,null,null,"CE","Julho"]
[null,null,null,null,null,null,null,null,null,null,null,null,null,null,null,null,null,null,null,null,null,null,null,null,null,null,"DF","Agosto"]
{"$rows_left_out":47}
{"sheet":"DEMANDA","index":1,"n_rows":158,"n_cols":48,"rows_kept":158,"cut":false,"hidden":false,"merged":[[45,1,45,17],[35,1,35,9],[36,1,37,9],[38,1,38,9],[20,11,34,17],[39,1,44,9],[3,10,44,10],[19,11,19,17],[35,11,35,17],[36,11,44,17],[34,1,34,7],[16,11,17,11],[16,16,16,17],[16,12,17,15],[18,12,18,15],[13,16,14,16],[13,17,14,17],[11,12,11,14],[12,12,12,14],[0,1,0,17],[10,11,11,11],[13,11,14,11],[13,12,14,13],[7,14,7,15],[13,14,14,15],[9,11,9,12],[9,13,9,17],[1,1,1,17],[2,1,2,17],[3,1,3,9],[33,1,33,7],[3,11,3,17],[5,12,5,17],[6,12,6,13],[6,14,6,15],[6,16,6,17],[4,12,4,17],[6,2,6,9],[5,2,5,9],[4,2,4,9],[10,12,10,16],[11,15,11,16],[12,15,12,16],[7,12,7,13],[15,14,15,15],[15,12,15,13]]}
[null,{"$f":"AC37","v":"DADOS CONFIRMADOS PARA AVALIAÇÃO DA CONCESSIONÁRIA"}]
[]
[null,"DECLARAÇÃO DE CARGA E CÁLCULO E DEMANDA "]
[null,"DECLARAÇÃO DE CARGA INSTALADA",null,null,null,null,null,null,null,null,null,"CÁLCULO DA DEMANDA INDIVIDUAL",null,null,null,null,null,null,null,null,null,null,null,null,null,null,null,{"$f":"M5","v":"15 - Indústria metalúrgica"},"Carga","Fd","D","(",")"," x ","DEMANDA (KVA) = ("," = "," + "]
[null,"PROPRIETÁRIO:",{"$f":"AB34","v":"Proprietário Exemplo"},null,null,null,null,null,null,null,null,"RAMO DE ATIVIDADE:","15 - Indústria metalúrgica",null,null,null,null,null,null,null,null,null,null,null,null,null,null,1,{"$f":"TRUNC((VLOOKUP($AB$4,AUX!$T$5:$Z$169,5,FALSE)),2)","v":234.46},{"$f":"(VLOOKUP($AB$4,AUX!$T$5:$Z$169,2,FALSE))/100","v":0.65},{"$f":"TRUNC((AC5*AD5),2)","v":152.38999999999999},{"$f":"CONCATENATE(AI4,$AF$4,AC5,$AH$4,AD5,$AJ$4,AE5,$AG$4)","v":"DEMANDA (KVA) = ((234,46 x 0,65 = 152,39)"},null,0,"A metodologia do Cálculo de Demanda ainda não foi definida pelo projetista"]
[null,"EDIFICAÇÃO:",{"$f":"AB35","v":"Hotel Exemplo"},null,null,null,null,null,null,null,null,"MÉTODO DE CÁLCULO:","Utilizar  Fator de Demanda e Fator de Potencia conforme NDU 002",null,null,null,null,null,null,null,null,null,null,null,null,null,null,2,{"$f":"TRUNC((VLOOKUP($AB$4,AUX!$T$5:$Z$169,6,FALSE)),2)","v":0},{"$f":"(VLOOKUP($AB$4,AUX!$T$5:$Z$169,3,FALSE))/100","v":0},{"$f":"TRUNC((AC6*AD6),2)","v":0},{"$f":"IF((AE6=0),\"\",(CONCATENATE(AK4,$AF$4,AC6,$AH$4,AD6,$AJ$4,AE6,$AG$4)))","v":""},null,{"$f":"AI9","v":"Utilizar  Fator de Demanda e Fator de Potencia conforme NDU 002"},{"$f":"CONCATENATE(AF5,AF6,AF7)","v":"DEMANDA (KVA) = ((234,46 x 0,65 = 152,39)) / 0,92"}]
[null,"ENDEREÇO:","Rua do Hotel Exemplo",null,null,null,null,null,null,null,null,"TIPO DE LIGAÇÃO:","Trifásico",null,"RAMAL DE LIGAÇÃO:",null,"Cabo nu - 2AWG",null,null,null,null,null,null,null,null,null,null,3,{"$f":"TRUNC((VLOOKUP($AB$4,AUX!$T$5:$Z$169,7,FALSE)),2)","v":0},{"$f":"(VLOOKUP($AB$4,AUX!$T$5:$Z$169,4,FALSE))/100","v":0},0,{"$f":"IF((AE7=0),AG7,(CONCATENATE(AK4,$AF$4,AC7,$AH$4,AD7,$AJ$4,AE7,$AG$4,AG7)))","v":") / 0,92"},") / 0,92",{"$f":"AI10","v":"Utilizar Fator de Demanda e Fator de Potência Definidos pelo Projetista"},"DEMANDA (KVA) = (CARGA (KW) x FD) / FP",{"$f":"SUM(I9:I33)","v":234.464}]
[null,"CARGA","TIPO DE CARGA","QTD","EIXO\n(CV)","TENSÃO \n(V)","POT. IND.\n(W)","FP","CARGA\n(kW)","CARGA\n(kVA)",null,"CARGA\n (kW)","FD",null,"FP",null,"DEMANDA\n (kVA)","DEMANDA\n (kW)",null,null,null,null,null,null,null,null,{"$f":"IF(OR(L13=0,M13=0),0,1)","v":1},"total",{"$f":"SUM(AC5:AC7)","v":234.46},{"$f":"AE8/AC8","v":0.6499616139213511},{"$f":"SUM(AE5:AE7)","v":152.38999999999999},{"$f":"TRUNC((AE8/0.92),2)","v":165.64}]
[null,"Iluminação","Ilum./Tomadas ",100,null,"220V",60,0.92,{"$f":"IF(OR((C9=0),(D9=0)),\"-\",(IF(OR((C9=$AF$16),(C9=$AF$17)),(D9*E9*0.736),((D9*G9)/1000))))","v":6},{"$f":"IF(OR((I9=\"-\"),(H9=0)),\"-\",(I9/H9))","v":6.5217391304347823},null,{"$f":"IF((AB18=0),\"-\",AB18)","v":234.464},{"$f":"IF(OR(AB18=0,M5=0,M6<>AI9),\"-\",AD8)","v":0.6499616139213511},null,{"$f":"IF(OR(AB18=0,M5=0,M6<>AI9),\"-\",0.92)","v":0.92},null,{"$f":"IF(OR(AB18=0,M6=0),\"-\",((IF((M6=AI9),AF8,(IF(OR(N9=\"\",P9=\"\"),\"-\",(L9*N9)/P9))))))","v":165.64},{"$f":"IF((Q9=\"-\"),\"-\",(IF((M6=AH6),(Q9*O9),(Q9*P9))))","v":152.3888},null,null,null,null,null,null,null,null,"FASE",{"$f":"IF((M7=\"\"),\"-\",(VLOOKUP(M7,AJ9:AK10,2,FALSE)))","v":"3#"},{"$f":"IF(OR((M13=\"\"),(AB18<=0)),\"-\",1)","v":1},null,null,"Ilum./Tomadas ","220V",{"$f":"AUX!T5","v":"1 - Indústria de extração e tratamento de minerais"},"Utilizar  Fator de Demanda e Fator de Potencia conforme NDU 002",{"$f":"IF(OR(AJ12>0,AC18>15),AJ10,AJ11)","v":"Trifásico"},{"$f":"IF((AJ9=AJ10),\"3#\",\"1#\")","v":"3#"},"Subterraneo","XLPE /EPR/HEPR - 0,6/1kV",5,"GRUPO A",{"$f":"AO9","v":"GRUPO A"},"HORO-SAZONAL VERDE",{"$f":"IF((AR12=0),AR13,(IF((L19=AO9),AQ9,AQ11)))","v":"HORO-SAZONAL VERDE"},null,null,null,{"$f":"C9","v":"Ilum./Tomadas "}]
[null,"Tomadas","Ilum./Tomadas ",60,null,"220V",300,0.92,{"$f":"IF(OR((C10=0),(D10=0)),\"-\",(IF(OR((C10=$AF$16),(C10=$AF$17)),(D10*E10*0.736),((D10*G10)/1000))))","v":18},{"$f":"IF(OR((I10=\"-\"),(H10=0)),\"-\",(I10/H10))","v":19.565217391304348},null,"Fórmula Adotada para a Demanda:",null,{"$f":"VLOOKUP(M6,AH5:AI7,2,FALSE)","v":"DEMANDA (KVA) = ((234,46 x 0,65 = 152,39)) / 0,92"},null,null,null,null,null,null,null,null,null,null,null,null,"SE",{"$f":"IF((AA8=0),\"-\",(CONCATENATE(AB9,AC10)))","v":"3#225"},{"$f":"L13","v":225},null,null,"Aquecimento","380V",{"$f":"AUX!T6","v":"2 - Extração de minérios de ferro"},"Utilizar Fator de Demanda e Fator de Potência Definidos pelo Projetista","Trifásico","3#","Cabo nu - 2AWG","PVC - 0,6/1kV",6,"GRUPO A OPTANTE B",{"$f":"IF((AC10<AB28),AO10,AO9)","v":"GRUPO A"},"HORO-SAZONAL AZUL",{"$f":"IF((AR12=0),AR13,(IF((L19=AO9),AQ10,AQ11)))","v":"HORO-SAZONAL AZUL"},null,null,null,{"$f":"C10","v":"Ilum./Tomadas "}]
{"$rows_left_out":149}
{"sheet":"TAB","index":2,"n_rows":301,"n_cols":45,"rows_kept":301,"cut":false,"hidden":true,"merged":[[37,4,38,4]]}
[null,null,null,null,null,null,null,null,null,null,null,null,null,null,null,null,null,null,null,null,null,null,null,null,null,null,null,null,null,null,null,null,null,null,null,null,null,"ÁREA ÚTIL\n(m²)","DEMANDA (kW)","ÁREA ÚTIL\n(m²)",null,0,null,"Nº Apto","F.\nMult."]
[null,null,null,null,null,null,null,null,null,null,null,null,null,null,null,null,null,null,null,null,null,null,null,null,null,null,null,null,null,null,null,null,null,null,null,null,null,0,15,0.39,null,null,null,1,"*"]
[null,null,null,null,null,null,null,null,null,null,null,null,null,null,null,null,null,null,null,null,null,null,null,null,null,null,null,null,null,null,null,null,null,null,null,null,null,16,20,0.51,null,null,null,2,"*"]
[null,"CONFIRMAR?","ATIVIDADE","TIPO DE CARGA","TENSÃO","LIGAÇÃO","CLASSE","lista resid","lista n-resid","CALCULO DA DEMANDA","MENSAGEM","ISOLAMENTO","CATEGORIA DE MEDIÇÃO","CABO XLPE","DJ","PE",null,null,null,null,null,null,null,null,null,null,null,null,"NP","NP","PE","DJ","DJ",null,"PE","Nº F",null,21,25,0.62,null,null,null,3,"*"]
["/ 220","SIM","Residencia","Ilum./Tomadas ","  220V","MONOFÁSICA","Residencial","Apartamento","Cant. de Obras","CALCULAR UTILIZANDO FATOR DE DEMANDA E FATOR DE POTENCIA CONFORME NDU 001","PREENCHA TODOS OS CAMPOS: CLASSE DE ATENDIMENTO; TIPO DE UC E RAMO DE ATIVIDADE.","XLPE /EPR/HEPR","M1","1#6(6)-XLPE/EPR/HEPR OU 1#6(6)-PVC","30/32",6,null,null,null,null,null,null,null,null,null,null,null,null,6,6,6,32,30,0.22,6,1,25,26,30,0.73,null,null,null,4,3.88]
["/ (380 * √3)","NÃO","Hospitais e Similares","Aquecimento","  380V","TRIFÁSICA","Não Residencial","Casa","Condominio","CALCULAR UTILIZANDO FATOR DE DEMANDA E FATOR DE POTENCIA DEFINIDOS PELO PROJETISTA","AGUARDANDO  A DECLARAÇÃO DAS CARGAS ","PVC","M2","1#10(10)-XLPE/EPR/HEPR OU 1#10(10)-PVC",50,10,null,null,null,null,null,null,null,null,null,null,null,null,10,10,10,50,40,0.22,10,1,25,31,35,0.84,null,null,null,5,4.84]
[null,null,"Hóteis e Similares","Tomadas Especiais",null,null,"Irrigante","Quitinete","Loja",null,"CARGA INSTALADA SUPERIOR A 75kW - O ATENDIMENTO DEVERÁ SER FEITO EM MT COM TRANSFORMADOR PARTICULAR",null,"M3","1#16(16)-XLPE/EPR/HEPR OU 1#16(16)-PVC",70,10,null,null,null,null,null,null,null,null,null,null,null,null,16,16,10,70,63,0.22,16,1,25,36,40,0.95,null,null,null,6,5.8]
[null,null,"Escritorio","Fogão/Forno Elétrico",null,null,null,"Flat","Sala Comercial",null,"DEMANDA SUPERIOR A 75kW - NECESSITA TRANSFORMADOR PARTICULAR .",null,"T1","3#6(6)-XLPE/EPR/HEPR OU 3#10(10)-PVC",40,6,null,null,null,null,null,null,null,null,null,null,null,null,10,10,6,40,30,0.65800000000000003,25,3,50,41,45,1.05,null,null,null,7,6.76]
[null,null,"Escolas e Similares","Refrigeração",null,null,null,"Outros","Outros",null,"CARGA MOTRIZ SUPERIOR A 30 CV E CARGA INSTALADA SUPERIOR A 50kW - O ATENDIMENTO DEVERÁ SER FEITO EM MT COM TRANSFORMADOR PARTICULAR",null,"T2","3#10(10)-XLPE/EPR/HEPR OU 3#10(10)-PVC",50,10,null,null,null,null,null,null,null,null,null,null,null,null,10,10,10,50,40,0.65800000000000003,35,3,32,46,50,1.1599999999999999,null,null,null,8,7.72]
[null,null,"Quarteis e Semelhantes","Raios-X",null,null,null,null,"Irrigação",null,"UC DENTRO DOS LIMITES PARA ATENDIMENTO EM BT. ",null,"T3","3#16(16)-XLPE/EPR/HEPR OU 3#16(16)-PVC",70,10,null,null,null,null,null,null,null,null,null,null,null,null,25,25,10,70,63,0.65800000000000003,50,3,40,51,55,1.26,null,null,null,9,8.68]
{"$rows_left_out":292}
{"sheet":"AUX","index":3,"n_rows":169,"n_cols":27,"rows_kept":169,"cut":false,"hidden":true,"merged":[]}
[]
[null,null,null,null,null,null,null,null,null,null,null,null,null,null,null,null,null,null,null,1,2,3,4,5,6,7]
[null,null,"TC","DISJUNTOR","XLPE","PVC","ELET","ELET","POSTE","ELO","MEDIDOR",12,null,"COD.","Ramo de Atividade","Intervalo Carga Instalada","FD\nMáx","FD\nTípico","FCTípico",null,1,2,3,1,2,3]
["1#5",5,"-","30/32","1#6(6)","1#6(6)",25,25,300,"0,5H","Monofásico","-",null,null,null,"(kW)","(%)","(%)","(%)"]
["1#10",10,"-",50,"1#10(10)","1#10(10)",25,25,300,"1H","Monofásico","-",null,1,"Indústria de extração e tratamento de minerais",null,70,43,26,{"$f":"CONCATENATE(N5,\" - \",O5)","v":"1 - Indústria de extração e tratamento de minerais"},{"$f":"Q5","v":70},{"$f":"IF((N6=N5),Q6,0)","v":0},{"$f":"IF((N5=N7),Q5,0)","v":0},{"$f":"IF((U5=0),0,(IF((P5=0),DEMANDA!$AB$18,(VALUE((RIGHT(P5,3)))))))","v":234.464},{"$f":"IF(OR(V5=0,DEMANDA!$AB$18<=X5),0,(DEMANDA!$AB$18-X5))","v":0},0,{"$f":"VALUE(X6)","v":500}]
["1#15",15,"-",70,"1#16(16)","1#16(16)",25,25,300,"2H","Monofásico","-",null,2,"Extração de minérios de ferro","≤500",54,36,34,"2 - Extração de minérios de ferro",{"$f":"Q6","v":54},{"$f":"IF((N7=N6),Q7,0)","v":67},{"$f":"IF((N6=N8),Q6,0)","v":0},{"$f":"IF((U6=0),0,(IF((P6=0),DEMANDA!$AB$18,(VALUE((RIGHT(P6,3)))))))","v":500},{"$f":"IF(OR(V6=0,DEMANDA!$AB$18<=X6),0,(DEMANDA!$AB$18-X6))","v":0},0]
["3#5",5,"-",40,"3#6(6)","3#6(6)",32,32,300,"0,5H","Trifásico 120A","-",null,{"$f":"N6","v":2},null,">500",67,49,35,"2 - ",67,0,0,{"$f":"IF((U7=0),0,(IF((P7=0),DEMANDA!$AB$18,(VALUE((RIGHT(P7,3)))))))","v":500},{"$f":"IF(OR(V7=0,DEMANDA!$AB$18<=X7),0,(DEMANDA!$AB$18-X7))","v":0},0]
["3#10",10,"-",40,"3#6(6)","3#6(6)",32,32,300,"1H","Trifásico 120A","-",null,3,"Extração de minérios de metais não ferrosos",null,85,78,76,"3 - Extração de minérios de metais não ferrosos",85,0,0,{"$f":"IF((U8=0),0,(IF((P8=0),DEMANDA!$AB$18,(VALUE((RIGHT(P8,3)))))))","v":234.464},{"$f":"IF(OR(V8=0,DEMANDA!$AB$18<=X8),0,(DEMANDA!$AB$18-X8))","v":0},0]
["3#15",15,"-",40,"3#6(6)","3#6(6)",32,32,300,"1H","Trifásico 120A","-",null,4,"Extração de minerais para fabricação de adubos fertilizantes e para elaboração de outros produtos químicos",null,54,37,29,"4 - Extração de minerais para fabricação de adubos fertilizantes e para elaboração de outros produtos químicos",54,0,0,{"$f":"IF((U9=0),0,(IF((P9=0),DEMANDA!$AB$18,(VALUE((RIGHT(P9,3)))))))","v":234.464},{"$f":"IF(OR(V9=0,DEMANDA!$AB$18<=X9),0,(DEMANDA!$AB$18-X9))","v":0},0]
["3#30",30,"-",50,"3#10(10)","3#10(10)",32,32,300,"2H","Trifásico 120A","-",null,5,"Extração de pedras e outros minerais para construção",null,67,49,16,"5 - Extração de pedras e outros minerais para construção",67,0,0,{"$f":"IF((U10=0),0,(IF((P10=0),DEMANDA!$AB$18,(VALUE((RIGHT(P10,3)))))))","v":234.464},{"$f":"IF(OR(V10=0,DEMANDA!$AB$18<=X10),0,(DEMANDA!$AB$18-X10))","v":0},0]
{"$rows_left_out":160}
{"sheet":"CAMPOS","index":4,"n_rows":260,"n_cols":7,"rows_kept":260,"cut":false,"hidden":true,"merged":[[0,0,0,2],[0,4,0,6]]}
["DADOS",null,null,null,"DEMANDA"]
["CAMPO","DADOS","FORMULA",null,"CAMPO","DADOS","FORMULA"]
[{"$f":"DADOS!C7","v":"TIPO DE PROJETO:"},{"$f":"DADOS!F7","v":"Subestação Aérea "},"NÃO",null,{"$f":"DEMANDA!B5","v":"PROPRIETÁRIO:"},{"$f":"DEMANDA!C5","v":"Proprietário Exemplo"},"SIM"]
[{"$f":"DADOS!M7","v":"PREVISÃO DE ATENDIMENTO:"},{"$f":"DADOS!R7","v":"Junho"},"NÃO",null,{"$f":"DEMANDA!B6","v":"EDIFICAÇÃO:"},{"$f":"DEMANDA!C6","v":"Hotel Exemplo"},"SIM"]
[{"$f":"A4","v":"PREVISÃO DE ATENDIMENTO:"},{"$f":"DADOS!U7","v":2017},"NÃO",null,{"$f":"DEMANDA!B7","v":"ENDEREÇO:"},{"$f":"DEMANDA!C7","v":"Rua do Hotel Exemplo"},"SIM"]
[{"$f":"DADOS!C8","v":"FINALIDADE:"},{"$f":"DADOS!F8","v":"Atender a um Hotel com entrada em tensão primária."},"NÃO",null,{"$f":"DEMANDA!B8","v":"CARGA"},{"$f":"DEMANDA!B9","v":"Iluminação"},"NÃO"]
[{"$f":"DADOS!C12","v":"DADOS DO PROPRIETÁRIO"},{"$f":"DADOS!G12","v":""},"SIM",null,{"$f":"E6","v":"CARGA"},{"$f":"DEMANDA!B10","v":"Tomadas"},"NÃO"]
[{"$f":"DADOS!C14","v":"NOME:"},{"$f":"DADOS!F14","v":"Proprietário Exemplo"},"NÃO",null,{"$f":"E7","v":"CARGA"},{"$f":"DEMANDA!B11","v":"Chuv. Eletrico"},"NÃO"]
[{"$f":"DADOS!C15","v":"PESSOA:"},{"$f":"DADOS!F15","v":"Empresa Privada"},"NÃO",null,"CARGA",{"$f":"DEMANDA!B12","v":"Central de Ar"},"NÃO"]
[{"$f":"DADOS!J15","v":"CNPJ:"},{"$f":"DADOS!L15","v":"25.086.034/0001-71 "},"NÃO",null,"CARGA",{"$f":"DEMANDA!B13","v":"Exautores"},"NÃO"]
{"$rows_left_out":250}